Reaction Details
Target5-hydroxytryptamine receptor 1A
LigandBDBM50327602
Substrate/Competitorn/a
Meas. Tech.ChEMBL_664675 (CHEMBL1260561)
Ki 0.541±n/a nM
Citation Favor, DAPowers, JJWhite, ADFitzgerald, LWGroppi, VSerpa, KA 6-Alkoxyisoindolin-1-one based dopamine D2 partial agonists as potential antipsychotics. Bioorg Med Chem Lett20:5666-9 (2010) 
 
5-hydroxytryptamine receptor 1A
Name:5-hydroxytryptamine receptor 1A
Type:n/a
Mol. Mass.:46122.49
Organism:Homo sapiens (Human)
Description:n/a
Residue:422
BDBM50327602
NameBDBM50327602
Synonyms:6-(3-(4-(naphthalen-1-yl)piperazin-1-yl)propoxy)isoindolin-1-one | CHEMBL1258533
TypeSmall organic molecule
Emp. Form.C25H27N3O2
Mol. Mass.401.5008
SMILESO=C1NCc2ccc(OCCCN3CCN(CC3)c3cccc4ccccc34)cc12