Reaction Details
TargetD(2) dopamine receptor
LigandBDBM50327614
Substrate/Competitorn/a
Meas. Tech.ChEMBL_664672 (CHEMBL1260558)
Ki 0.576±n/a nM
Citation Favor, DAPowers, JJWhite, ADFitzgerald, LWGroppi, VSerpa, KA 6-Alkoxyisoindolin-1-one based dopamine D2 partial agonists as potential antipsychotics. Bioorg Med Chem Lett20:5666-9 (2010) 
 
D(2) dopamine receptor
Name:D(2) dopamine receptor
Type:Cell-surface receptors
Mol. Mass.:50647.10
Organism:Homo sapiens (Human)
Description:P14416
Residue:443
BDBM50327614
NameBDBM50327614
Synonyms:6-(4-(4-(chroman-8-yl)piperazin-1-yl)butoxy)isoindolin-1-one | CHEMBL1257735
TypeSmall organic molecule
Emp. Form.C25H31N3O3
Mol. Mass.421.5319
SMILESO=C1NCc2ccc(OCCCCN3CCN(CC3)c3cccc4CCCOc34)cc12