Reaction Details
Target5-hydroxytryptamine receptor 1A
LigandBDBM50327616
Substrate/Competitorn/a
Meas. Tech.ChEMBL_664675 (CHEMBL1260561)
Ki 0.786±n/a nM
Citation Favor, DAPowers, JJWhite, ADFitzgerald, LWGroppi, VSerpa, KA 6-Alkoxyisoindolin-1-one based dopamine D2 partial agonists as potential antipsychotics. Bioorg Med Chem Lett20:5666-9 (2010) 
 
5-hydroxytryptamine receptor 1A
Name:5-hydroxytryptamine receptor 1A
Type:n/a
Mol. Mass.:46122.49
Organism:Homo sapiens (Human)
Description:n/a
Residue:422
BDBM50327616
NameBDBM50327616
Synonyms:7-chloro-6-(3-(4-(naphthalen-1-yl)piperazin-1-yl)propoxy)isoindolin-1-one | CHEMBL1258882
TypeSmall organic molecule
Emp. Form.C25H26ClN3O2
Mol. Mass.435.946
SMILESClc1c2C(=O)NCc2ccc1OCCCN1CCN(CC1)c1cccc2ccccc12