Reaction Details
Target5-hydroxytryptamine receptor 2A
LigandBDBM50327601
Substrate/Competitorn/a
Meas. Tech.ChEMBL_664673 (CHEMBL1260559)
Ki 11.3±n/a nM
Citation Favor, DAPowers, JJWhite, ADFitzgerald, LWGroppi, VSerpa, KA 6-Alkoxyisoindolin-1-one based dopamine D2 partial agonists as potential antipsychotics. Bioorg Med Chem Lett20:5666-9 (2010) 
 
5-hydroxytryptamine receptor 2A
Name:5-hydroxytryptamine receptor 2A
Type:undefined
Mol. Mass.:52607.65
Organism:Homo sapiens (Human)
Description:P28223
Residue:471
BDBM50327601
NameBDBM50327601
Synonyms:6-(3-(4-(8-fluoronaphthalen-1-yl)piperazin-1-yl)propoxy)isoindolin-1-one | CHEMBL1258761
TypeSmall organic molecule
Emp. Form.C25H26FN3O2
Mol. Mass.419.4912
SMILESFc1cccc2cccc(N3CCN(CCCOc4ccc5CNC(=O)c5c4)CC3)c12