Reaction Details
Target5-hydroxytryptamine receptor 2A
LigandBDBM50327604
Substrate/Competitorn/a
Meas. Tech.ChEMBL_664673 (CHEMBL1260559)
Ki 25.3±n/a nM
Citation Favor, DAPowers, JJWhite, ADFitzgerald, LWGroppi, VSerpa, KA 6-Alkoxyisoindolin-1-one based dopamine D2 partial agonists as potential antipsychotics. Bioorg Med Chem Lett20:5666-9 (2010) 
 
5-hydroxytryptamine receptor 2A
Name:5-hydroxytryptamine receptor 2A
Type:undefined
Mol. Mass.:52607.65
Organism:Homo sapiens (Human)
Description:P28223
Residue:471
BDBM50327604
NameBDBM50327604
Synonyms:6-(3-(4-(chroman-8-yl)piperazin-1-yl)propoxy)isoindolin-1-one | CHEMBL1257734
TypeSmall organic molecule
Emp. Form.C24H29N3O3
Mol. Mass.407.5054
SMILESO=C1NCc2ccc(OCCCN3CCN(CC3)c3cccc4CCCOc34)cc12