Reaction Details
TargetBifunctional epoxide hydrolase 2
LigandBDBM50327848
Substrate/Competitorn/a
Meas. Tech.ChEMBL_664906 (CHEMBL1259738)
IC50 0.7±n/a nM
Citation Rose, TEMorisseau, CLiu, JYInceoglu, BJones, PDSanborn, JRHammock, BD 1-Aryl-3-(1-acylpiperidin-4-yl)urea inhibitors of human and murine soluble epoxide hydrolase: structure-activity relationships, pharmacokinetics, and reduction of inflammatory pain. J Med Chem53:7067-75 (2010) 
 
Bifunctional epoxide hydrolase 2
Name:Bifunctional epoxide hydrolase 2
Type:Enzyme
Mol. Mass.:62512.06
Organism:Mus musculus (Mouse)
Description:P34914
Residue:554
BDBM50327848
NameBDBM50327848
Synonyms:1-(1-(Ethylsulfonyl)piperidin-4-yl)-3-(4-(trifluoromethoxy)phenyl)urea US10383835, Compound 2213 | US9296693, 56
TypeSmall organic molecule
Emp. Form.C15H20F3N3O4S
Mol. Mass.395.397
SMILESCCS(=O)(=O)N1CCC(CC1)NC(=O)Nc1ccc(OC(F)(F)F)cc1