Reaction Details
TargetBifunctional epoxide hydrolase 2
LigandBDBM50327811
Substrate/Competitorn/a
Meas. Tech.ChEMBL_664906 (CHEMBL1259738)
IC50 2.3±n/a nM
Citation Rose, TEMorisseau, CLiu, JYInceoglu, BJones, PDSanborn, JRHammock, BD 1-Aryl-3-(1-acylpiperidin-4-yl)urea inhibitors of human and murine soluble epoxide hydrolase: structure-activity relationships, pharmacokinetics, and reduction of inflammatory pain. J Med Chem53:7067-75 (2010) 
 
Bifunctional epoxide hydrolase 2
Name:Bifunctional epoxide hydrolase 2
Type:Enzyme
Mol. Mass.:62512.06
Organism:Mus musculus (Mouse)
Description:P34914
Residue:554
BDBM50327811
NameBDBM50327811
Synonyms:1-(4-Chloro-3-(trifluoromethyl)phenyl)-3-(1-propionylpiperidin-4-yl)urea US9296693, 35
TypeSmall organic molecule
Emp. Form.C16H19ClF3N3O2
Mol. Mass.377.789
SMILESCCC(=O)N1CCC(CC1)NC(=O)Nc1ccc(Cl)c(c1)C(F)(F)F