Reaction Details
Target5-hydroxytryptamine receptor 4
LigandBDBM50327858
Substrate/Competitorn/a
Meas. Tech.ChEMBL_664907 (CHEMBL1259739)
Ki 0.200000±n/a nM
Citation Xu, RHong, JMorse, CLPike, VW Synthesis, structure-affinity relationships, and radiolabeling of selective high-affinity 5-HT4 receptor ligands as prospective imaging probes for positron emission tomography. J Med Chem53:7035-47 (2010) 
 
5-hydroxytryptamine receptor 4
Name:5-hydroxytryptamine receptor 4
Type:Enzyme Catalytic Domain
Mol. Mass.:43735.29
Organism:GUINEA PIG
Description:5-HT4 HTR4 GUINEA PIG::O70528
Residue:388
BDBM50327858
NameBDBM50327858
Synonyms:(1-Butylpiperidin-4-yl)methyl 8-amino-7-iodo-2,3-dihydrobenzo-[b][1,4]dioxine-5-carboxylate CHEMBL114112 SB207710
TypeSmall organic molecule
Emp. Form.C19H27IN2O4
Mol. Mass.474.3332
SMILESCCCCN1CCC(COC(=O)c2cc(I)c(N)c3OCCOc23)CC1