Reaction Details
Target5-hydroxytryptamine receptor 4
LigandBDBM50327858
Substrate/Competitorn/a
Meas. Tech.ChEMBL_664908 (CHEMBL1259740)
Ki 2.2±n/a nM
Citation Xu, RHong, JMorse, CLPike, VW Synthesis, structure-affinity relationships, and radiolabeling of selective high-affinity 5-HT4 receptor ligands as prospective imaging probes for positron emission tomography. J Med Chem53:7035-47 (2010) 
 
5-hydroxytryptamine receptor 4
Name:5-hydroxytryptamine receptor 4
Type:Enzyme
Mol. Mass.:43767.54
Organism:Homo sapiens (Human)
Description:Q13639
Residue:388
BDBM50327858
NameBDBM50327858
Synonyms:(1-Butylpiperidin-4-yl)methyl 8-amino-7-iodo-2,3-dihydrobenzo-[b][1,4]dioxine-5-carboxylate CHEMBL114112 SB207710
TypeSmall organic molecule
Emp. Form.C19H27IN2O4
Mol. Mass.474.3332
SMILESCCCCN1CCC(COC(=O)c2cc(I)c(N)c3OCCOc23)CC1