Reaction Details
Target5-hydroxytryptamine receptor 4
LigandBDBM50327867
Substrate/Competitorn/a
Meas. Tech.ChEMBL_664908 (CHEMBL1259740)
Ki 9.1±n/a nM
Citation Xu, RHong, JMorse, CLPike, VW Synthesis, structure-affinity relationships, and radiolabeling of selective high-affinity 5-HT4 receptor ligands as prospective imaging probes for positron emission tomography. J Med Chem53:7035-47 (2010) 
 
5-hydroxytryptamine receptor 4
Name:5-hydroxytryptamine receptor 4
Type:Enzyme
Mol. Mass.:43767.54
Organism:Homo sapiens (Human)
Description:Q13639
Residue:388
BDBM50327867
NameBDBM50327867
Synonyms:(1-Butylpiperidin-4-yl)methyl 8-(methylamino)-2,3-dihydrobenzo-[b][1,4]dioxine-5-carboxylate | CHEMBL1258109
TypeSmall organic molecule
Emp. Form.C20H30N2O4
Mol. Mass.362.4632
SMILESCCCCN1CCC(COC(=O)c2ccc(NC)c3OCCOc23)CC1