Reaction Details
Target5-hydroxytryptamine receptor 4
LigandBDBM50327873
Substrate/Competitorn/a
Meas. Tech.ChEMBL_664908 (CHEMBL1259740)
Ki 8664±n/a nM
Citation Xu, RHong, JMorse, CLPike, VW Synthesis, structure-affinity relationships, and radiolabeling of selective high-affinity 5-HT4 receptor ligands as prospective imaging probes for positron emission tomography. J Med Chem53:7035-47 (2010) 
 
5-hydroxytryptamine receptor 4
Name:5-hydroxytryptamine receptor 4
Type:Enzyme
Mol. Mass.:43767.54
Organism:Homo sapiens (Human)
Description:Q13639
Residue:388
BDBM50327873
NameBDBM50327873
Synonyms:4-Amino-N-((1-butylpiperidin-4-yl)methyl)-3-methoxybenzamide | CHEMBL1258559
TypeSmall organic molecule
Emp. Form.C18H29N3O2
Mol. Mass.319.4418
SMILESCCCCN1CCC(CNC(=O)c2ccc(N)c(OC)c2)CC1