Reaction Details
Target5-hydroxytryptamine receptor 4
LigandBDBM50327874
Substrate/Competitorn/a
Meas. Tech.ChEMBL_664908 (CHEMBL1259740)
Ki 12±n/a nM
Citation Xu, RHong, JMorse, CLPike, VW Synthesis, structure-affinity relationships, and radiolabeling of selective high-affinity 5-HT4 receptor ligands as prospective imaging probes for positron emission tomography. J Med Chem53:7035-47 (2010) 
 
5-hydroxytryptamine receptor 4
Name:5-hydroxytryptamine receptor 4
Type:Enzyme
Mol. Mass.:43767.54
Organism:Homo sapiens (Human)
Description:Q13639
Residue:388
BDBM50327874
NameBDBM50327874
Synonyms:(1-Pentylpiperidin-4-yl)methyl 4-Amino-3-methoxybenzoate | CHEMBL1258561
TypeSmall organic molecule
Emp. Form.C19H30N2O3
Mol. Mass.334.4531
SMILESCCCCCN1CCC(COC(=O)c2ccc(N)c(OC)c2)CC1