Reaction Details
Target5-hydroxytryptamine receptor 1B
LigandBDBM50327861
Substrate/Competitorn/a
Meas. Tech.ChEMBL_664925 (CHEMBL1259757)
Ki>10000±n/a nM
Citation Xu, RHong, JMorse, CLPike, VW Synthesis, structure-affinity relationships, and radiolabeling of selective high-affinity 5-HT4 receptor ligands as prospective imaging probes for positron emission tomography. J Med Chem53:7035-47 (2010) 
 
5-hydroxytryptamine receptor 1B
Name:5-hydroxytryptamine receptor 1B
Type:G Protein-Coupled Receptor (GPCR)
Mol. Mass.:43579.17
Organism:Homo sapiens (Human)
Description:Receptor binding assays were performed using human clone stably expressed in CHO cells
Residue:390
BDBM50327861
NameBDBM50327861
Synonyms:(1-Butylpiperidin-4-yl)methyl 4-Amino-3-methoxybenzoate | CHEMBL1258452
TypeSmall organic molecule
Emp. Form.C18H28N2O3
Mol. Mass.320.4265
SMILESCCCCN1CCC(COC(=O)c2ccc(N)c(OC)c2)CC1