Reaction Details
TargetD(1B) dopamine receptor
LigandBDBM50327863
Substrate/Competitorn/a
Meas. Tech.ChEMBL_664954 (CHEMBL1259911)
Ki>10000±n/a nM
Citation Xu, RHong, JMorse, CLPike, VW Synthesis, structure-affinity relationships, and radiolabeling of selective high-affinity 5-HT4 receptor ligands as prospective imaging probes for positron emission tomography. J Med Chem53:7035-47 (2010) 
 
D(1B) dopamine receptor
Name:D(1B) dopamine receptor
Type:Protein
Mol. Mass.:52943.41
Organism:Homo sapiens (Human)
Description:P21918
Residue:477
BDBM50327863
NameBDBM50327863
Synonyms:(1-Butylpiperidin-4-yl)methyl 8-Amino-7-fluoro-2,3-dihydrobenzo[b][1,4]dioxine-5-carboxylate | CHEMBL1258671
TypeSmall organic molecule
Emp. Form.C19H27FN2O4
Mol. Mass.366.4271
SMILESCCCCN1CCC(COC(=O)c2cc(F)c(N)c3OCCOc23)CC1