Reaction Details
TargetD(1B) dopamine receptor
LigandBDBM50327861
Substrate/Competitorn/a
Meas. Tech.ChEMBL_664954 (CHEMBL1259911)
Ki>10000±n/a nM
Citation Xu, RHong, JMorse, CLPike, VW Synthesis, structure-affinity relationships, and radiolabeling of selective high-affinity 5-HT4 receptor ligands as prospective imaging probes for positron emission tomography. J Med Chem53:7035-47 (2010) 
 
D(1B) dopamine receptor
Name:D(1B) dopamine receptor
Type:Protein
Mol. Mass.:52943.41
Organism:Homo sapiens (Human)
Description:P21918
Residue:477
BDBM50327861
NameBDBM50327861
Synonyms:(1-Butylpiperidin-4-yl)methyl 4-Amino-3-methoxybenzoate | CHEMBL1258452
TypeSmall organic molecule
Emp. Form.C18H28N2O3
Mol. Mass.320.4265
SMILESCCCCN1CCC(COC(=O)c2ccc(N)c(OC)c2)CC1