Reaction Details
TargetSecretin receptor
LigandBDBM50327887
Substrate/Competitorn/a
Meas. Tech.ChEMBL_664975 (CHEMBL1259932)
Ki 3.5±n/a nM
Citation Dong, MPinon, DIBordner, AJMiller, LJ Elucidation of the active conformation of the amino terminus of receptor-bound secretin using intramolecular disulfide bond constraints. Bioorg Med Chem Lett20:6040-4 (2010) 
 
Secretin receptor
Name:Secretin receptor
Type:PROTEIN
Mol. Mass.:50215.16
Organism:Homo sapiens (Human)
Description:ChEMBL_664976
Residue:440
BDBM50327887
NameBDBM50327887
Synonyms:CHEMBL1255581 | HSDGTFTSELSRLQDSARLQRLLQGLV-NH2
TypeSmall organic molecule
Emp. Form.C129H216N42O42
Mol. Mass.3027.3515
SMILESCC(C)C[C@H](NC(=O)CNC(=O)[C@H](CCC(N)=O)NC(=O)[C@H](CC(C)C)NC(=O)[C@H](CC(C)C)NC(=O)[C@H](CCCN=C(N)N)NC(=O)[C@H](CCC(N)=O)NC(=O)[C@H](CC(C)C)NC(=O)[C@H](CCCN=C(N)N)NC(=O)[C@H](C)NC(=O)[C@H](CO)NC(=O)[C@H](CC(O)=O)NC(=O)[C@H](CCC(N)=O)NC(=O)[C@H](CC(C)C)NC(=O)[C@H](CCCN=C(N)N)NC(=O)[C@H](CO)NC(=O)[C@H](CC(C)C)NC(=O)[C@H](CCC(O)=O)NC(=O)[C@H](CO)NC(=O)[C@@H](NC(=O)[C@H](Cc1ccccc1)NC(=O)[C@@H](NC(=O)CNC(=O)[C@H](CC(O)=O)NC(=O)[C@H](CO)NC(=O)[C@@H](N)Cc1cnc[nH]1)[C@@H](C)O)[C@@H](C)O)C(=O)N[C@@H](C(C)C)C(N)=O