Reaction Details
TargetSecretin receptor
LigandBDBM50327888
Substrate/Competitorn/a
Meas. Tech.ChEMBL_664975 (CHEMBL1259932)
Ki 11±n/a nM
Citation Dong, MPinon, DIBordner, AJMiller, LJ Elucidation of the active conformation of the amino terminus of receptor-bound secretin using intramolecular disulfide bond constraints. Bioorg Med Chem Lett20:6040-4 (2010) 
 
Secretin receptor
Name:Secretin receptor
Type:PROTEIN
Mol. Mass.:50215.16
Organism:Homo sapiens (Human)
Description:ChEMBL_664976
Residue:440
BDBM50327888
NameBDBM50327888
Synonyms:CHEMBL1256314
TypeSmall organic molecule
Emp. Form.C129H208N42O40S2
Mol. Mass.3051.419
SMILESCC(C)C[C@H](NC(=O)CNC(=O)[C@H](CCC(N)=O)NC(=O)[C@H](CC(C)C)NC(=O)[C@H](CC(C)C)NC(=O)[C@H](CCCN=C(N)N)NC(=O)[C@H](CCC(N)=O)NC(=O)[C@H](CC(C)C)NC(=O)[C@H](CCCN=C(N)N)NC(=O)[C@H](C)NC(=O)[C@H](CO)NC(=O)[C@H](CC(O)=O)NC(=O)[C@H](CCC(N)=O)NC(=O)[C@H](CC(C)C)NC(=O)[C@H](CCCN=C(N)N)NC(=O)[C@H](CO)NC(=O)[C@H](Cc1ccc(O)cc1)NC(=O)[C@@H]1CSSC[C@H](NC(=O)[C@H](Cc2ccccc2)NC(=O)[C@@H](NC(=O)CNC(=O)[C@H](CC(O)=O)NC(=O)[C@H](CO)NC(=O)[C@@H](N)Cc2cnc[nH]2)[C@@H](C)O)C(=O)N[C@@H](CO)C(=O)N1)C(=O)N[C@@H](C(C)C)C(N)=O