Reaction Details
TargetSerine/threonine-protein kinase mTOR
LigandBDBM50327897
Substrate/Competitorn/a
Meas. Tech.ChEMBL_665023 (CHEMBL1260133)
Ki 6±n/a nM
Citation Liu, KKBagrodia, SBailey, SCheng, HChen, HGao, LGreasley, SHoffman, JEHu, QJohnson, TOKnighton, DLiu, ZMarx, MANambu, MDNinkovic, SPascual, BRafidi, KRodgers, CMSmith, GLSun, SWang, HYang, AYuan, JZou, A 4-methylpteridinones as orally active and selective PI3K/mTOR dual inhibitors. Bioorg Med Chem Lett20:6096-9 (2010) 
 
Serine/threonine-protein kinase mTOR
Name:Serine/threonine-protein kinase mTOR
Type:Rapamycin target protein
Mol. Mass.:288917.12
Organism:Homo sapiens (Human)
Description:P42345
Residue:2549
BDBM50327897
NameBDBM50327897
Synonyms:2-amino-8-isopropyl-4-methyl-6-(1H-pyrazol-5-yl)pteridin-7(8H)-one | CHEMBL1258567
TypeSmall organic molecule
Emp. Form.C13H15N7O
Mol. Mass.285.3045
SMILESCC(C)n1c2nc(N)nc(C)c2nc(-c2cc[nH]n2)c1=O