Reaction Details
TargetFatty acid synthase
LigandBDBM50155446
Substrate/Competitorn/a
Meas. Tech.ChEMBL_665032 (CHEMBL1260142)
IC50 40980±n/a nM
Citation Jiang, HZQuan, XFTian, WXHu, JMWang, PCHuang, SZCheng, ZQLiang, WJZhou, JMa, XFZhao, YX Fatty acid synthase inhibitors of phenolic constituents isolated from Garcinia mangostana. Bioorg Med Chem Lett20:6045-7 (2010) 
 
Fatty acid synthase
Name:Fatty acid synthase
Type:Enzyme
Mol. Mass.:273419.37
Organism:Homo sapiens (Human)
Description:P49327
Residue:2511
BDBM50155446
NameBDBM50155446
Synonyms:1,3,7-Trihydroxy xanthone (3) 1,3,7-trihydroxy-9H-xanthen-9-one | CHEMBL361025
TypeSmall organic molecule
Emp. Form.C13H8O5
Mol. Mass.244.1996
SMILESOc1ccc2oc3cc(O)cc(O)c3c(=O)c2c1