Reaction Details
TargetAurora kinase A
LigandBDBM50327918
Substrate/Competitorn/a
Meas. Tech.ChEMBL_665036 (CHEMBL1260146)
IC50 48±n/a nM
Citation Bindi, SFancelli, DAlli, CBerta, DBertrand, JACameron, ADCappella, PCarpinelli, PCervi, GCroci, VD'Anello, MForte, BGiorgini, MLMarsiglio, AMoll, JPesenti, EPittalà, VPulici, MRiccardi-Sirtori, FRoletto, FSoncini, CStorici, PVarasi, MVolpi, DZugnoni, PVianello, P Thieno[3,2-c]pyrazoles: a novel class of Aurora inhibitors with favorable antitumor activity. Bioorg Med Chem18:7113-20 (2010) 
 
Aurora kinase A
Name:Aurora kinase A
Type:Serine/threonine-protein kinase
Mol. Mass.:45830.98
Organism:Homo sapiens (Human)
Description:O14965
Residue:403
BDBM50327918
NameBDBM50327918
Synonyms:3-[4-(4-Methyl-piperazin-1-yl)-benzoylamino]-1H-thieno[3,2-c]pyrazole-5-carboxylic acid benzhydryl-amide | CHEMBL1257884
TypeSmall organic molecule
Emp. Form.C31H30N6O2S
Mol. Mass.550.674
SMILESCN1CCN(CC1)c1ccc(cc1)C(=O)Nc1[nH]nc2cc(sc12)C(=O)NC(c1ccccc1)c1ccccc1