Reaction Details
TargetAurora kinase A
LigandBDBM50327929
Substrate/Competitorn/a
Meas. Tech.ChEMBL_665036 (CHEMBL1260146)
IC50 6±n/a nM
Citation Bindi, SFancelli, DAlli, CBerta, DBertrand, JACameron, ADCappella, PCarpinelli, PCervi, GCroci, VD'Anello, MForte, BGiorgini, MLMarsiglio, AMoll, JPesenti, EPittalà, VPulici, MRiccardi-Sirtori, FRoletto, FSoncini, CStorici, PVarasi, MVolpi, DZugnoni, PVianello, P Thieno[3,2-c]pyrazoles: a novel class of Aurora inhibitors with favorable antitumor activity. Bioorg Med Chem18:7113-20 (2010) 
 
Aurora kinase A
Name:Aurora kinase A
Type:Serine/threonine-protein kinase
Mol. Mass.:45830.98
Organism:Homo sapiens (Human)
Description:O14965
Residue:403
BDBM50327929
NameBDBM50327929
Synonyms:3-[4-(4-Methyl-piperazin-1-yl)-benzoylamino]-1H-thieno[3,2-c]pyrazole-5-carboxylic acid(R)-1-phenyl-ethyl)-amide | CHEMBL1257296
TypeSmall organic molecule
Emp. Form.C26H28N6O2S
Mol. Mass.488.605
SMILESC[C@@H](NC(=O)c1cc2n[nH]c(NC(=O)c3ccc(cc3)N3CCN(C)CC3)c2s1)c1ccccc1