Reaction Details
TargetProtein kinase C gamma type
LigandBDBM50327943
Substrate/Competitorn/a
Meas. Tech.ChEMBL_665132 (CHEMBL1260395)
Ki 0.630000±n/a nM
Citation Yanagita, RCKamachi, HTanaka, KMurakami, ANakagawa, YTokuda, HNagai, HIrie, K Role of the phenolic hydroxyl group in the biological activities of simplified analogue of aplysiatoxin with antiproliferative activity. Bioorg Med Chem Lett20:6064-6 (2010) 
 
Protein kinase C gamma type
Name:Protein kinase C gamma type
Type:Enzyme
Mol. Mass.:78458.05
Organism:Homo sapiens (Human)
Description:The recombinant human PKC enzymes were produced using a baculovirus expression system in SF9 cells
Residue:697
BDBM50327943
NameBDBM50327943
Synonyms:Aplysiatoxin | CHEMBL1256416
TypeSmall organic molecule
Emp. Form.C32H47BrO10
Mol. Mass.671.614
SMILESCO[C@@H](CC[C@H](C)[C@H]1O[C@@]23C[C@H](OC(=O)C[C@@H](OC(=O)C[C@](O)(O2)[C@H](C)CC3(C)C)[C@@H](C)O)[C@@H]1C)c1cc(O)ccc1Br