Reaction Details
TargetProtein kinase C theta type
LigandBDBM50327945
Substrate/Competitorn/a
Meas. Tech.ChEMBL_665137 (CHEMBL1260400)
Ki 170±n/a nM
Citation Yanagita, RCKamachi, HTanaka, KMurakami, ANakagawa, YTokuda, HNagai, HIrie, K Role of the phenolic hydroxyl group in the biological activities of simplified analogue of aplysiatoxin with antiproliferative activity. Bioorg Med Chem Lett20:6064-6 (2010) 
 
Protein kinase C theta type
Name:Protein kinase C theta type
Type:Serine/threonine-protein kinase
Mol. Mass.:81878.04
Organism:Homo sapiens (Human)
Description:Full-length human PKC theta (Panvera Catalog No. P2996).
Residue:706
BDBM50327945
NameBDBM50327945
Synonyms:(1R,3R,5R,9R,13R)-9-Hydroxymethyl-3-(4-phenyl-butyl)-2,6,10,17-tetraoxa-tricyclo[11.3.1.1'1,5']octadecane-7,11-dione | CHEMBL1258349
TypeSmall organic molecule
Emp. Form.C25H34O7
Mol. Mass.446.5333
SMILESOC[C@H]1CC(=O)O[C@@H]2C[C@@H](CCCCc3ccccc3)O[C@@]3(CCC[C@H](CC(=O)O1)O3)C2