Reaction Details
TargetProlyl hydroxylase EGLN2
LigandBDBM50328017
Substrate/Competitorn/a
Meas. Tech.ChEMBL_665252 (CHEMBL1260833)
IC50>1000000±n/a nM
Citation Conejo-Garcia, AMcDonough, MALoenarz, CMcNeill, LAHewitson, KSGe, WLiénard, BMSchofield, CJClifton, IJ Structural basis for binding of cyclic 2-oxoglutarate analogues to factor-inhibiting hypoxia-inducible factor. Bioorg Med Chem Lett20:6125-8 (2010) 
 
Prolyl hydroxylase EGLN2
Name:Prolyl hydroxylase EGLN2
Type:Protein
Mol. Mass.:43657.01
Organism:Homo sapiens (Human)
Description:Q96KS0
Residue:407
BDBM50328017
NameBDBM50328017
Synonyms:2-(3-HYDROXYPHENYL)-2-OXO-ETHANOIC ACID CHEMBL1230698
TypeSmall organic molecule
Emp. Form.C8H6O4
Mol. Mass.166.1308
SMILESOC(=O)C(=O)c1cccc(O)c1