Reaction Details
TargetProlyl hydroxylase EGLN2
LigandBDBM26110
Substrate/Competitorn/a
Meas. Tech.ChEMBL_665252 (CHEMBL1260833)
IC50 18370±n/a nM
Citation Conejo-Garcia, AMcDonough, MALoenarz, CMcNeill, LAHewitson, KSGe, WLiénard, BMSchofield, CJClifton, IJ Structural basis for binding of cyclic 2-oxoglutarate analogues to factor-inhibiting hypoxia-inducible factor. Bioorg Med Chem Lett20:6125-8 (2010) 
 
Prolyl hydroxylase EGLN2
Name:Prolyl hydroxylase EGLN2
Type:Protein
Mol. Mass.:43657.01
Organism:Homo sapiens (Human)
Description:Q96KS0
Residue:407
BDBM26110
NameBDBM26110
Synonyms:N,3-dihydroxybenzamide | aromatic hydroxamic acid, 5a
TypeSmall organic molecule
Emp. Form.C7H7NO3
Mol. Mass.153.1354
SMILESONC(=O)c1cccc(O)c1