Reaction Details
TargetProlyl hydroxylase EGLN2
LigandBDBM26113
Substrate/Competitorn/a
Meas. Tech.ChEMBL_665252 (CHEMBL1260833)
IC50 624800±n/a nM
Citation Conejo-Garcia, AMcDonough, MALoenarz, CMcNeill, LAHewitson, KSGe, WLiénard, BMSchofield, CJClifton, IJ Structural basis for binding of cyclic 2-oxoglutarate analogues to factor-inhibiting hypoxia-inducible factor. Bioorg Med Chem Lett20:6125-8 (2010) 
 
Prolyl hydroxylase EGLN2
Name:Prolyl hydroxylase EGLN2
Type:Protein
Mol. Mass.:43657.01
Organism:Homo sapiens (Human)
Description:Q96KS0
Residue:407
BDBM26113
NameBDBM26113
Synonyms:2,4 PDCA pyridine carboxylate, 6a | pyridine-2,4-dicarboxylic acid
TypeSmall organic molecule
Emp. Form.C7H5NO4
Mol. Mass.167.1189
SMILESOC(=O)c1ccnc(c1)C(O)=O