Reaction Details
TargetProlyl hydroxylase EGLN2
LigandBDBM50328021
Substrate/Competitorn/a
Meas. Tech.ChEMBL_665252 (CHEMBL1260833)
IC50>1000000±n/a nM
Citation Conejo-Garcia, AMcDonough, MALoenarz, CMcNeill, LAHewitson, KSGe, WLiénard, BMSchofield, CJClifton, IJ Structural basis for binding of cyclic 2-oxoglutarate analogues to factor-inhibiting hypoxia-inducible factor. Bioorg Med Chem Lett20:6125-8 (2010) 
 
Prolyl hydroxylase EGLN2
Name:Prolyl hydroxylase EGLN2
Type:Protein
Mol. Mass.:43657.01
Organism:Homo sapiens (Human)
Description:Q96KS0
Residue:407
BDBM50328021
NameBDBM50328021
Synonyms:(2-Hydroxy-benzoylamino)-acetic acid 2-Hydroxyhippuric acid NSC-87566 | Salicyluric Acid (50-80-%)
TypeSmall organic molecule
Emp. Form.C9H9NO4
Mol. Mass.195.1721
SMILESOC(=O)CNC(=O)c1ccccc1O