Reaction Details
TargetCathepsin D
LigandBDBM50328048
Substrate/Competitorn/a
Meas. Tech.ChEMBL_665268 (CHEMBL1260849)
IC50 8±n/a nM
Citation Probst, GDBowers, SSealy, JMStupi, BDressen, DJagodzinska, BMAquino, JGailunas, ATruong, APTso, LXu, YZHom, RKJohn, VTung, JSPleiss, MATucker, JAKonradi, AWSham, HLJagodzinski, JToth, GBrecht, EYao, NPan, HLin, MArtis, DRRuslim, LBova, MPSinha, SYednock, TAGauby, SZmolek, WQuinn, KPSauer, JM Design and synthesis of hydroxyethylamine (HEA) BACE-1 inhibitors: structure-activity relationship of the aryl region. Bioorg Med Chem Lett20:6034-9 (2010) 
 
Cathepsin D
Name:Cathepsin D
Type:Enzyme
Mol. Mass.:44551.72
Organism:Homo sapiens (Human)
Description:Human proCathepsin D (SwissProt accession number P07339) was expressed in Sf9 cells, purified, and autoactivated.
Residue:412
BDBM50328048
NameBDBM50328048
Synonyms:CHEMBL1257185
TypeSmall organic molecule
Emp. Form.C30H41F2N5O2
Mol. Mass.541.6756
SMILESCC(=O)N[C@@H](Cc1cc(F)cc(F)c1)[C@H](O)CNC1(CCCCC1)c1cn(nn1)C12CC3CC(CC(C3)C1)C2