Reaction Details
TargetCytochrome P450 3A4
LigandBDBM7461
Substrate/Competitorn/a
Meas. Tech.ChEMBL_665395 (CHEMBL1261124)
IC50>50000±n/a nM
Citation He, LHe, FBi, HLi, JZeng, SLuo, HBHuang, M Isoform-selective inhibition of chrysin towards human cytochrome P450 1A2. Kinetics analysis, molecular docking, and molecular dynamics simulations. Bioorg Med Chem Lett20:6008-12 (2010) 
 
Cytochrome P450 3A4
Name:Cytochrome P450 3A4
Type:Enzyme
Mol. Mass.:57349.57
Organism:Homo sapiens (Human)
Description:n/a
Residue:503
BDBM7461
NameBDBM7461
Synonyms:5,7-dihydroxy-2-phenyl-4H-chromen-4-one 5,7-dihydroxyflavone chrysin | cid_5281607
TypeSmall organic molecule
Emp. Form.C15H10O4
Mol. Mass.254.2375
SMILESOc1cc(O)c2c(c1)oc(cc2=O)-c1ccccc1