Reaction Details
TargetMalonyl-CoA decarboxylase, mitochondrial
LigandBDBM50328216
Substrate/Competitorn/a
Meas. Tech.ChEMBL_665404 (CHEMBL1261133)
IC50 12±n/a nM
Citation Tang, HYan, YFeng, Zde Jesus, RKYang, LLevorse, DAOwens, KAAkiyama, TEBergeron, RCastriota, GADoebber, TWEllsworth, KPLassman, MELi, CWu, MSZhang, BBChapman, KTMills, SGBerger, JPPasternak, A Design and synthesis of a new class of malonyl-CoA decarboxylase inhibitors with anti-obesity and anti-diabetic activities. Bioorg Med Chem Lett20:6088-92 (2010) 
 
Malonyl-CoA decarboxylase, mitochondrial
Name:Malonyl-CoA decarboxylase, mitochondrial
Type:PROTEIN
Mol. Mass.:55018.37
Organism:Homo sapiens (Human)
Description:ChEMBL_665404
Residue:493
BDBM50328216
NameBDBM50328216
Synonyms:1,1,1,3,3,3-hexafluoro-2-(2-(4-(3-nitrophenyl)piperazin-1-yl)thiazol-5-yl)propan-2-ol | CHEMBL1258365
TypeSmall organic molecule
Emp. Form.C16H14F6N4O3S
Mol. Mass.456.363
SMILESOC(c1cnc(s1)N1CCN(CC1)c1cccc(c1)[N+]([O-])=O)(C(F)(F)F)C(F)(F)F