Reaction Details
TargetMalonyl-CoA decarboxylase, mitochondrial
LigandBDBM50328223
Substrate/Competitorn/a
Meas. Tech.ChEMBL_665404 (CHEMBL1261133)
IC50 5.1±n/a nM
Citation Tang, HYan, YFeng, Zde Jesus, RKYang, LLevorse, DAOwens, KAAkiyama, TEBergeron, RCastriota, GADoebber, TWEllsworth, KPLassman, MELi, CWu, MSZhang, BBChapman, KTMills, SGBerger, JPPasternak, A Design and synthesis of a new class of malonyl-CoA decarboxylase inhibitors with anti-obesity and anti-diabetic activities. Bioorg Med Chem Lett20:6088-92 (2010) 
 
Malonyl-CoA decarboxylase, mitochondrial
Name:Malonyl-CoA decarboxylase, mitochondrial
Type:PROTEIN
Mol. Mass.:55018.37
Organism:Homo sapiens (Human)
Description:ChEMBL_665404
Residue:493
BDBM50328223
NameBDBM50328223
Synonyms:2-(4-(5-(1,1,1,3,3,3-hexafluoro-2-hydroxypropan-2-yl)thiazol-2-yl)piperazin-1-yl)benzoic acid | CHEMBL1258700
TypeSmall organic molecule
Emp. Form.C17H15F6N3O3S
Mol. Mass.455.375
SMILESOC(=O)c1ccccc1N1CCN(CC1)c1ncc(s1)C(O)(C(F)(F)F)C(F)(F)F