Reaction Details
TargetMalonyl-CoA decarboxylase, mitochondrial
LigandBDBM50328244
Substrate/Competitorn/a
Meas. Tech.ChEMBL_665404 (CHEMBL1261133)
IC50 1.4±n/a nM
Citation Tang, HYan, YFeng, Zde Jesus, RKYang, LLevorse, DAOwens, KAAkiyama, TEBergeron, RCastriota, GADoebber, TWEllsworth, KPLassman, MELi, CWu, MSZhang, BBChapman, KTMills, SGBerger, JPPasternak, A Design and synthesis of a new class of malonyl-CoA decarboxylase inhibitors with anti-obesity and anti-diabetic activities. Bioorg Med Chem Lett20:6088-92 (2010) 
 
Malonyl-CoA decarboxylase, mitochondrial
Name:Malonyl-CoA decarboxylase, mitochondrial
Type:PROTEIN
Mol. Mass.:55018.37
Organism:Homo sapiens (Human)
Description:ChEMBL_665404
Residue:493
BDBM50328244
NameBDBM50328244
Synonyms:4-(4-fluorophenyl)-1-(5-(1,1,1,3,3,3-hexafluoro-2-hydroxypropan-2-yl)thiazol-2-yl)piperidine-4-carboxylic acid | CHEMBL1258139
TypeSmall organic molecule
Emp. Form.C18H15F7N2O3S
Mol. Mass.472.377
SMILESOC(=O)C1(CCN(CC1)c1ncc(s1)C(O)(C(F)(F)F)C(F)(F)F)c1ccc(F)cc1