Reaction Details
TargetMalonyl-CoA decarboxylase, mitochondrial
LigandBDBM50119362
Substrate/Competitorn/a
Meas. Tech.ChEMBL_665404 (CHEMBL1261133)
IC50 13.3±n/a nM
Citation Tang, HYan, YFeng, Zde Jesus, RKYang, LLevorse, DAOwens, KAAkiyama, TEBergeron, RCastriota, GADoebber, TWEllsworth, KPLassman, MELi, CWu, MSZhang, BBChapman, KTMills, SGBerger, JPPasternak, A Design and synthesis of a new class of malonyl-CoA decarboxylase inhibitors with anti-obesity and anti-diabetic activities. Bioorg Med Chem Lett20:6088-92 (2010) 
 
Malonyl-CoA decarboxylase, mitochondrial
Name:Malonyl-CoA decarboxylase, mitochondrial
Type:PROTEIN
Mol. Mass.:55018.37
Organism:Homo sapiens (Human)
Description:ChEMBL_665404
Residue:493
BDBM50119362
NameBDBM50119362
Synonyms:2-{4-[1-(3,4-Bis-difluoromethoxy-phenyl)-2-(1-oxy-pyridin-4-yl)-ethyl]-3-methyl-phenyl}-1,1,1,3,3,3-hexafluoro-propan-2-ol | CHEMBL102718
TypeSmall organic molecule
Emp. Form.C25H19F10NO4
Mol. Mass.587.4067
SMILESCc1cc(ccc1C(Cc1cc[n+]([O-])cc1)c1ccc(OC(F)F)c(OC(F)F)c1)C(O)(C(F)(F)F)C(F)(F)F