Reaction Details
TargetEpidermal growth factor receptor
LigandBDBM50328256
Substrate/Competitorn/a
Meas. Tech.ChEMBL_665430 (CHEMBL1261159)
IC50 10900±n/a nM
Citation Liu, JJDaniewski, IDing, QHiggins, BJu, GKolinsky, KKonzelmann, FLukacs, CPizzolato, GRossman, PSwain, AThakkar, KWei, CCMiklowski, DYang, HYin, XWovkulich, PM Pyrazolobenzodiazepines: part I. Synthesis and SAR of a potent class of kinase inhibitors. Bioorg Med Chem Lett20:5984-7 (2010) 
 
Epidermal growth factor receptor
Name:Epidermal growth factor receptor
Type:Receptor Kinase Domain
Mol. Mass.:134279.59
Organism:Homo sapiens (Human)
Description:P00533
Residue:1210
BDBM50328256
NameBDBM50328256
Synonyms:5-(2-fluorophenyl)-2,10-dihydrobenzo[e]pyrazolo[4,3-b][1,4]diazepine-7-carbonitrile | CHEMBL1257795
TypeSmall organic molecule
Emp. Form.C17H10FN5
Mol. Mass.303.2932
SMILESFc1ccccc1C1=Nc2cn[nH]c2Nc2ccc(cc12)C#N