Reaction Details
TargetVascular endothelial growth factor receptor 2
LigandBDBM50328258
Substrate/Competitorn/a
Meas. Tech.ChEMBL_665427 (CHEMBL1261156)
IC50 33±n/a nM
Citation Liu, JJDaniewski, IDing, QHiggins, BJu, GKolinsky, KKonzelmann, FLukacs, CPizzolato, GRossman, PSwain, AThakkar, KWei, CCMiklowski, DYang, HYin, XWovkulich, PM Pyrazolobenzodiazepines: part I. Synthesis and SAR of a potent class of kinase inhibitors. Bioorg Med Chem Lett20:5984-7 (2010) 
 
Vascular endothelial growth factor receptor 2
Name:Vascular endothelial growth factor receptor 2
Type:Receptor Tyrosine Kinase
Mol. Mass.:151510.97
Organism:Homo sapiens (Human)
Description:P35968
Residue:1356
BDBM50328258
NameBDBM50328258
Synonyms:CHEMBL1257912 | N-(5-(2-chlorophenyl)-2,10-dihydrobenzo[e]pyrazolo[4,3-b][1,4]diazepin-7-yl)acetamide
TypeSmall organic molecule
Emp. Form.C18H14ClN5O
Mol. Mass.351.79
SMILESCC(=O)Nc1ccc2Nc3[nH]ncc3N=C(c3ccccc3Cl)c2c1