Reaction Details
TargetBeta-2 adrenergic receptor
LigandBDBM50328302
Substrate/Competitorn/a
Meas. Tech.ChEMBL_665492 (CHEMBL1261323)
Ki 25±n/a nM
Citation Tasler, SBaumgartner, RAmmendola, ASchachtner, JWieber, TBlisse, MRath, SZaja, MKlahn, PQuotschalla, UNey, P Thienopyrimidines asß3-adrenoceptor agonists: hit-to-lead optimization. Bioorg Med Chem Lett20:6108-15 (2010) 
 
Beta-2 adrenergic receptor
Name:Beta-2 adrenergic receptor
Type:n/a
Mol. Mass.:46461.69
Organism:Homo sapiens (Human)
Description:P07550
Residue:413
BDBM50328302
NameBDBM50328302
Synonyms:4-(2-hydroxy-3-(1-(5-phenylthieno[2,3-d]pyrimidin-4-yl)piperidin-4-ylamino)propoxy)-3-(hydroxymethyl)phenol | CHEMBL1257554
TypeSmall organic molecule
Emp. Form.C27H30N4O4S
Mol. Mass.506.617
SMILESOCc1cc(O)ccc1OCC(O)CNC1CCN(CC1)c1ncnc2scc(-c3ccccc3)c12