Reaction Details
TargetBeta-3 adrenergic receptor
LigandBDBM50328292
Substrate/Competitorn/a
Meas. Tech.ChEMBL_665493 (CHEMBL1261324)
Ki 62±n/a nM
Citation Tasler, SBaumgartner, RAmmendola, ASchachtner, JWieber, TBlisse, MRath, SZaja, MKlahn, PQuotschalla, UNey, P Thienopyrimidines asß3-adrenoceptor agonists: hit-to-lead optimization. Bioorg Med Chem Lett20:6108-15 (2010) 
 
Beta-3 adrenergic receptor
Name:Beta-3 adrenergic receptor
Type:G Protein-Coupled Receptor (GPCR)
Mol. Mass.:43534.88
Organism:Homo sapiens (Human)
Description:n/a
Residue:408
BDBM50328292
NameBDBM50328292
Synonyms:4-(2-hydroxy-3-(1-(5-(thiophen-2-yl)thieno[2,3-d]pyrimidin-4-yl)piperidin-4-ylamino)propoxy)-2-(hydroxymethyl)phenol | CHEMBL1258143
TypeSmall organic molecule
Emp. Form.C25H28N4O4S2
Mol. Mass.512.644
SMILESOCc1cc(OCC(O)CNC2CCN(CC2)c2ncnc3scc(-c4cccs4)c23)ccc1O