Reaction Details
TargetBeta-3 adrenergic receptor
LigandBDBM50328308
Substrate/Competitorn/a
Meas. Tech.ChEMBL_665493 (CHEMBL1261324)
Ki 37±n/a nM
Citation Tasler, SBaumgartner, RAmmendola, ASchachtner, JWieber, TBlisse, MRath, SZaja, MKlahn, PQuotschalla, UNey, P Thienopyrimidines asß3-adrenoceptor agonists: hit-to-lead optimization. Bioorg Med Chem Lett20:6108-15 (2010) 
 
Beta-3 adrenergic receptor
Name:Beta-3 adrenergic receptor
Type:G Protein-Coupled Receptor (GPCR)
Mol. Mass.:43534.88
Organism:Homo sapiens (Human)
Description:n/a
Residue:408
BDBM50328308
NameBDBM50328308
Synonyms:1-(3-(2-hydroxy-3-(1-(5-phenylthieno[2,3-d]pyrimidin-4-yl)piperidin-4-ylamino)propoxy)phenyl)urea | CHEMBL1258824
TypeSmall organic molecule
Emp. Form.C27H30N6O3S
Mol. Mass.518.631
SMILESNC(=O)Nc1cccc(OCC(O)CNC2CCN(CC2)c2ncnc3scc(-c4ccccc4)c23)c1