Reaction Details
TargetBeta-2 adrenergic receptor
LigandBDBM50328293
Substrate/Competitorn/a
Meas. Tech.ChEMBL_665492 (CHEMBL1261323)
Ki 28±n/a nM
Citation Tasler, SBaumgartner, RAmmendola, ASchachtner, JWieber, TBlisse, MRath, SZaja, MKlahn, PQuotschalla, UNey, P Thienopyrimidines asß3-adrenoceptor agonists: hit-to-lead optimization. Bioorg Med Chem Lett20:6108-15 (2010) 
 
Beta-2 adrenergic receptor
Name:Beta-2 adrenergic receptor
Type:n/a
Mol. Mass.:46461.69
Organism:Homo sapiens (Human)
Description:P07550
Residue:413
BDBM50328293
NameBDBM50328293
Synonyms:4-(2-hydroxy-3-(1-(5-(thiophen-2-yl)thieno[2,3-d]pyrimidin-4-yl)piperidin-4-ylamino)propoxy)phenol | CHEMBL1258026
TypeSmall organic molecule
Emp. Form.C24H26N4O3S2
Mol. Mass.482.618
SMILESOC(CNC1CCN(CC1)c1ncnc2scc(-c3cccs3)c12)COc1ccc(O)cc1