Reaction Details
TargetBeta-2 adrenergic receptor
LigandBDBM50328328
Substrate/Competitorn/a
Meas. Tech.ChEMBL_665492 (CHEMBL1261323)
Ki 18±n/a nM
Citation Tasler, SBaumgartner, RAmmendola, ASchachtner, JWieber, TBlisse, MRath, SZaja, MKlahn, PQuotschalla, UNey, P Thienopyrimidines asß3-adrenoceptor agonists: hit-to-lead optimization. Bioorg Med Chem Lett20:6108-15 (2010) 
 
Beta-2 adrenergic receptor
Name:Beta-2 adrenergic receptor
Type:n/a
Mol. Mass.:46461.69
Organism:Homo sapiens (Human)
Description:P07550
Residue:413
BDBM50328328
NameBDBM50328328
Synonyms:1-(3-(hydroxymethyl)phenoxy)-3-(1-(5-phenylthieno[2,3-d]pyrimidin-4-yl)piperidin-4-ylamino)propan-2-ol | CHEMBL1258371
TypeSmall organic molecule
Emp. Form.C27H30N4O3S
Mol. Mass.490.617
SMILESOCc1cccc(OCC(O)CNC2CCN(CC2)c2ncnc3scc(-c4ccccc4)c23)c1