Reaction Details
TargetBeta-1 adrenergic receptor
LigandBDBM50328300
Substrate/Competitorn/a
Meas. Tech.ChEMBL_665487 (CHEMBL1261318)
Ki 484±n/a nM
Citation Tasler, SBaumgartner, RAmmendola, ASchachtner, JWieber, TBlisse, MRath, SZaja, MKlahn, PQuotschalla, UNey, P Thienopyrimidines asß3-adrenoceptor agonists: hit-to-lead optimization. Bioorg Med Chem Lett20:6108-15 (2010) 
 
Beta-1 adrenergic receptor
Name:Beta-1 adrenergic receptor
Type:G Protein-Coupled Receptor (GPCR)
Mol. Mass.:51338.40
Organism:Homo sapiens (Human)
Description:P08588
Residue:477
BDBM50328300
NameBDBM50328300
Synonyms:4-(2-hydroxy-3-(1-(5-phenylthieno[2,3-d]pyrimidin-4-yl)piperidin-4-ylamino)propoxy)-2-(methoxymethyl)phenol | CHEMBL1257675
TypeSmall organic molecule
Emp. Form.C28H32N4O4S
Mol. Mass.520.643
SMILESCOCc1cc(OCC(O)CNC2CCN(CC2)c2ncnc3scc(-c4ccccc4)c23)ccc1O