Reaction Details
TargetBeta-3 adrenergic receptor
LigandBDBM50328337
Substrate/Competitorn/a
Meas. Tech.ChEMBL_665493 (CHEMBL1261324)
Ki 17±n/a nM
Citation Tasler, SBaumgartner, RAmmendola, ASchachtner, JWieber, TBlisse, MRath, SZaja, MKlahn, PQuotschalla, UNey, P Thienopyrimidines asß3-adrenoceptor agonists: hit-to-lead optimization. Bioorg Med Chem Lett20:6108-15 (2010) 
 
Beta-3 adrenergic receptor
Name:Beta-3 adrenergic receptor
Type:G Protein-Coupled Receptor (GPCR)
Mol. Mass.:43534.88
Organism:Homo sapiens (Human)
Description:n/a
Residue:408
BDBM50328337
NameBDBM50328337
Synonyms:1-phenoxy-3-(1-(5-phenylthieno[2,3-d]pyrimidin-4-yl)piperidin-4-ylamino)propan-2-ol | CHEMBL1255596
TypeSmall organic molecule
Emp. Form.C26H28N4O2S
Mol. Mass.460.591
SMILESOC(CNC1CCN(CC1)c1ncnc2scc(-c3ccccc3)c12)COc1ccccc1