Reaction Details
TargetBeta-1 adrenergic receptor
LigandBDBM50328330
Substrate/Competitorn/a
Meas. Tech.ChEMBL_665487 (CHEMBL1261318)
Ki 293±n/a nM
Citation Tasler, SBaumgartner, RAmmendola, ASchachtner, JWieber, TBlisse, MRath, SZaja, MKlahn, PQuotschalla, UNey, P Thienopyrimidines asß3-adrenoceptor agonists: hit-to-lead optimization. Bioorg Med Chem Lett20:6108-15 (2010) 
 
Beta-1 adrenergic receptor
Name:Beta-1 adrenergic receptor
Type:G Protein-Coupled Receptor (GPCR)
Mol. Mass.:51338.40
Organism:Homo sapiens (Human)
Description:P08588
Residue:477
BDBM50328330
NameBDBM50328330
Synonyms:1-(3-fluorophenoxy)-3-(1-(5-phenylthieno[2,3-d]pyrimidin-4-yl)piperidin-4-ylamino)propan-2-ol | CHEMBL1258258
TypeSmall organic molecule
Emp. Form.C26H27FN4O2S
Mol. Mass.478.582
SMILESOC(CNC1CCN(CC1)c1ncnc2scc(-c3ccccc3)c12)COc1cccc(F)c1