Reaction Details
TargetReceptor-type tyrosine-protein kinase FLT3
LigandBDBM50328409
Substrate/Competitorn/a
Meas. Tech.ChEMBL_665527 (CHEMBL1261358)
IC50 1460±n/a nM
Citation Chen, CHLee, OYao, CNChuang, MYChang, YLChang, MHWen, YFYang, WHKo, CHChou, NTLin, MWLai, CPSun, CYWang, LMChen, YCHseu, THChang, CNHsu, HCLin, HCChang, YLShih, YCChou, SHHsu, YLTseng, HWLiu, CPTu, CMHu, TLTsai, YJChen, TSLin, CLChiou, SJLiu, CCHwang, CS Novel azulene-based derivatives as potent multi-receptor tyrosine kinase inhibitors. Bioorg Med Chem Lett20:6129-32 (2010) 
 
Receptor-type tyrosine-protein kinase FLT3
Name:Receptor-type tyrosine-protein kinase FLT3
Type:Enzyme
Mol. Mass.:112888.62
Organism:Homo sapiens (Human)
Description:P36888
Residue:993
BDBM50328409
NameBDBM50328409
Synonyms:(Z)-3-((4-(3-(dimethylamino)propoxy)-3-methylazulen-1-yl)methylene)-1H-pyrrolo[2,3-b]pyridin-2(3H)-one | CHEMBL1258376
TypeSmall organic molecule
Emp. Form.C24H25N3O2
Mol. Mass.387.4742
SMILESCN(C)CCCOc1ccccc2c(\C=C3/C(=O)Nc4ncccc34)cc(C)c12