Reaction Details
TargetMast/stem cell growth factor receptor Kit
LigandBDBM50328414
Substrate/Competitorn/a
Meas. Tech.ChEMBL_665524 (CHEMBL679436)
IC50 44±n/a nM
Citation Chen, CHLee, OYao, CNChuang, MYChang, YLChang, MHWen, YFYang, WHKo, CHChou, NTLin, MWLai, CPSun, CYWang, LMChen, YCHseu, THChang, CNHsu, HCLin, HCChang, YLShih, YCChou, SHHsu, YLTseng, HWLiu, CPTu, CMHu, TLTsai, YJChen, TSLin, CLChiou, SJLiu, CCHwang, CS Novel azulene-based derivatives as potent multi-receptor tyrosine kinase inhibitors. Bioorg Med Chem Lett20:6129-32 (2010) 
 
Mast/stem cell growth factor receptor Kit
Name:Mast/stem cell growth factor receptor Kit
Type:Protein
Mol. Mass.:109869.37
Organism:Homo sapiens (Human)
Description:P10721
Residue:976
BDBM50328414
NameBDBM50328414
Synonyms:CHEMBL1258603 | E/Z-(S)-5-fluoro-3-((4-(2-(2-(hydroxymethyl)pyrrolidin-1-yl)ethoxy)-3-methylazulen-1-yl)methylene)indolin-2-one
TypeSmall organic molecule
Emp. Form.C27H27FN2O3
Mol. Mass.446.5133
SMILESCc1cc(C=C2C(=O)Nc3ccc(F)cc23)c2ccccc(OCCN3CCC[C@H]3CO)c12