Reaction Details
TargetAurora kinase A
LigandBDBM50328420
Substrate/Competitorn/a
Meas. Tech.ChEMBL_665540 (CHEMBL1261371)
IC50 6700±n/a nM
Citation Bouloc, NLarge, JMKosmopoulou, MSun, CFaisal, AMatteucci, MReynisson, JBrown, NAtrash, BBlagg, JMcDonald, ELinardopoulos, SBayliss, RBavetsias, V Structure-based design of imidazo[1,2-a]pyrazine derivatives as selective inhibitors of Aurora-A kinase in cells. Bioorg Med Chem Lett20:5988-93 (2010) 
 
Aurora kinase A
Name:Aurora kinase A
Type:Serine/threonine-protein kinase
Mol. Mass.:45830.98
Organism:Homo sapiens (Human)
Description:O14965
Residue:403
BDBM50328420
NameBDBM50328420
Synonyms:CHEMBL1257210 | N-phenyl-6-(pyridin-3-yl)imidazo[1,2-a]pyrazin-8-amine
TypeSmall organic molecule
Emp. Form.C17H13N5
Mol. Mass.287.3186
SMILESN(c1ccccc1)c1nc(cn2ccnc12)-c1cccnc1