Reaction Details
Target5-hydroxytryptamine receptor 2A
LigandBDBM50328452
Substrate/Competitorn/a
Meas. Tech.ChEMBL_665580 (CHEMBL1261464)
Ki 180±n/a nM
Citation Skultety, MHübner, HLöber, SGmeiner, P Bioisosteric replacement leading to biologically active [2.2]paracyclophanes with altered binding profiles for aminergic G-protein-coupled receptors. J Med Chem53:7219-28 (2010) 
 
5-hydroxytryptamine receptor 2A
Name:5-hydroxytryptamine receptor 2A
Type:Enzyme Catalytic Domain
Mol. Mass.:52679.13
Organism:PIG
Description:5-HT2 0 0::P50129
Residue:470
BDBM50328452
NameBDBM50328452
Synonyms:4-[4-(4-Chlorophenyl)piperazin-1-yl]-1-(2,5-dimethylphenyl)-butan-1-one | CHEMBL1258155
TypeSmall organic molecule
Emp. Form.C23H28ClNO
Mol. Mass.369.928
SMILESCc1ccc(C)c(c1)C(=O)CCCN1CCC(CC1)c1ccc(Cl)cc1