Reaction Details
TargetD(2) dopamine receptor
LigandBDBM50328444
Substrate/Competitorn/a
Meas. Tech.ChEMBL_665576 (CHEMBL1261460)
Ki 6.5±n/a nM
Citation Skultety, MHübner, HLöber, SGmeiner, P Bioisosteric replacement leading to biologically active [2.2]paracyclophanes with altered binding profiles for aminergic G-protein-coupled receptors. J Med Chem53:7219-28 (2010) 
 
D(2) dopamine receptor
Name:D(2) dopamine receptor
Type:Cell-surface receptors
Mol. Mass.:50647.10
Organism:Homo sapiens (Human)
Description:P14416
Residue:443
BDBM50328444
NameBDBM50328444
Synonyms:4-[4-(2,5-Dimethylphenyl)-4-hydroxypiperidin-1-yl]-1-(4-fluorophenyl)butan-1-one | CHEMBL1257689
TypeSmall organic molecule
Emp. Form.C23H28FNO2
Mol. Mass.369.4723
SMILESCc1ccc(C)c(c1)C1(O)CCN(CCCC(=O)c2ccc(F)cc2)CC1