Reaction Details
TargetD(2) dopamine receptor
LigandBDBM50328450
Substrate/Competitorn/a
Meas. Tech.ChEMBL_665576 (CHEMBL1261460)
Ki 16±n/a nM
Citation Skultety, MHübner, HLöber, SGmeiner, P Bioisosteric replacement leading to biologically active [2.2]paracyclophanes with altered binding profiles for aminergic G-protein-coupled receptors. J Med Chem53:7219-28 (2010) 
 
D(2) dopamine receptor
Name:D(2) dopamine receptor
Type:Cell-surface receptors
Mol. Mass.:50647.10
Organism:Homo sapiens (Human)
Description:P14416
Residue:443
BDBM50328450
NameBDBM50328450
Synonyms:4-[4-(2,5-Dimethylphenyl)piperazin-1-yl]-1-(4-fluorophenyl)-butan-1-one | CHEMBL1258037
TypeSmall organic molecule
Emp. Form.C22H27FN2O
Mol. Mass.354.461
SMILESCc1ccc(C)c(c1)N1CCN(CCCC(=O)c2ccc(F)cc2)CC1