Reaction Details
TargetD(3) dopamine receptor
LigandBDBM50119386
Substrate/Competitorn/a
Meas. Tech.ChEMBL_665577 (CHEMBL1261461)
Ki 0.27±n/a nM
Citation Skultety, MHübner, HLöber, SGmeiner, P Bioisosteric replacement leading to biologically active [2.2]paracyclophanes with altered binding profiles for aminergic G-protein-coupled receptors. J Med Chem53:7219-28 (2010) 
 
D(3) dopamine receptor
Name:D(3) dopamine receptor
Type:n/a
Mol. Mass.:44243.43
Organism:Homo sapiens (Human)
Description:n/a
Residue:400
BDBM50119386
NameBDBM50119386
Synonyms:Benzo[b]thiophene-2-carboxylic acid {4-[4-(2-methoxy-phenyl)-piperazin-1-yl]-butyl}-amide N-(4-(4-(2-methoxyphenyl)piperazin-1-yl)butyl)benzo[b]thiophene-2-carboxamide
TypeSmall organic molecule
Emp. Form.C24H29N3O2S
Mol. Mass.423.571
SMILESCOc1ccccc1N1CCN(CCCCNC(=O)c2cc3ccccc3s2)CC1